BDBM465879 US10793576, Example 111
SMILES CC#CC(=O)N1C2C[C@@H](C1c1nc(-c3ccc(Oc4ccccc4)cc3)c3c(N)nccn13)N(C2)C(C)C
InChI Key InChIKey=NSHFBVUYYCIWAX-BMMPOPSUSA-N
Data  1 IC50
  Tab Delimited (TSV)   2D SDfile   Computed 3D by Vconf -m prep SDfile
Find this compound or compounds like it in BindingDB:
Activity Spreadsheet -- Enzyme Inhibition Constant Data from BindingDB
Found 1 hit for monomerid = 465879
TargetTyrosine-protein kinase BTK(Homo sapiens (Human))
Chengdu Brilliant Pharmaceutical
US Patent
LigandPNGBDBM465879(US10793576, Example 111)
Affinity DataIC50:  30nM. Assay description: 1: Test Principle:Mobility-Shift Assay, which is microfluidic chip technology, applies the basic concept of capillary electrophoresis to microfluidic...
Ligand InfoPC cidPC sid
In DepthDetails US Patent